Job 'Release' failed on 'refs/heads/main' #1
Robin Shen opened 5 days ago

Build #27 of job "Release" on ref "refs/heads/main" FAILED.

  • Project: onedev/docker/opencode
  • Commit: 70b06ffe
  • Status: FAILED (4/4 steps executed, step-3 FAILED after 4661 ms)
  • Step results: step-0 SUCCESSFUL (340 ms), step-1 SUCCESSFUL (3986 ms), step-2 SUCCESSFUL (1313 ms), step-3 FAILED (4661 ms)
  • Submitter: robin (submit reason: 手动重新提交)
  • Submitted: 2026-10-06T11:16:06.769+00:00, Finished: 2026-10-06T11:16:22.044+00:00 (running duration 15001 ms)
  • Build link: https://code.onedev.io/onedev/docker/opencode/~builds/27
1/1
Type
Build Failed
Priority
Major
Assignee
Labels
No labels
Build
#27
Issue Votes (0)
Watchers (2)
Reference
onedev/docker/opencode#1
Please wait...
Connection lost or session expired, reload to recover
Page is in error, reload to recover